Reaction Details
TargetDipeptidase 1
LigandBDBM50023983
Substrate/Competitorn/a
Meas. Tech.ChEBML_216035
Ki 80±n/a nM
Citation Graham, DWAshton, WTBarash, LBrown, JEBrown, RDCanning, LFChen, ASpringer, JPRogers, EF Inhibition of the mammalian beta-lactamase renal dipeptidase (dehydropeptidase-I) by (Z)-2-(acylamino)-3-substituted-propenoic acids. J Med Chem30:1074-90 (1987) Dipeptidase 1
Name:Dipeptidase 1
Type:Enzyme Catalytic Domain
Mol. Mass.:44697.32
Organism:GUINEA PIG
Description:Leukotriene D4 Alpha 0 GUINEA PIG::P22412
Residue:409
BDBM50023983
NameBDBM50023983
Synonyms:2-[(2,2-Dichloro-cyclopropanecarbonyl)-amino]-but-2-enoic acid | CHEMBL12086
TypeSmall organic molecule
Emp. Form.C8H9Cl2NO3
Mol. Mass.238.068
SMILESC\C=C(/NC(=O)C1CC1(Cl)Cl)C(O)=O