Reaction Details
TargetDipeptidase 1
LigandBDBM50024012
Substrate/Competitorn/a
Meas. Tech.ChEBML_216035
Ki 150±n/a nM
Citation Graham, DWAshton, WTBarash, LBrown, JEBrown, RDCanning, LFChen, ASpringer, JPRogers, EF Inhibition of the mammalian beta-lactamase renal dipeptidase (dehydropeptidase-I) by (Z)-2-(acylamino)-3-substituted-propenoic acids. J Med Chem30:1074-90 (1987) Dipeptidase 1
Name:Dipeptidase 1
Type:Enzyme Catalytic Domain
Mol. Mass.:44697.32
Organism:GUINEA PIG
Description:Leukotriene D4 Alpha 0 GUINEA PIG::P22412
Residue:409
BDBM50024012
NameBDBM50024012
Synonyms:2-[(2,2-Dimethyl-cyclopropanecarbonyl)-amino]-8-methylsulfanyl-oct-2-enoic acid | CHEMBL11967
TypeSmall organic molecule
Emp. Form.C15H25NO3S
Mol. Mass.299.429
SMILESCSCCCCC\C=C(/NC(=O)C1CC1(C)C)C(O)=O