Reaction Details
TargetDipeptidase 1
LigandBDBM50024069
Substrate/Competitorn/a
Meas. Tech.ChEBML_216035
Ki 130±n/a nM
Citation Graham, DWAshton, WTBarash, LBrown, JEBrown, RDCanning, LFChen, ASpringer, JPRogers, EF Inhibition of the mammalian beta-lactamase renal dipeptidase (dehydropeptidase-I) by (Z)-2-(acylamino)-3-substituted-propenoic acids. J Med Chem30:1074-90 (1987) Dipeptidase 1
Name:Dipeptidase 1
Type:Enzyme Catalytic Domain
Mol. Mass.:44697.32
Organism:GUINEA PIG
Description:Leukotriene D4 Alpha 0 GUINEA PIG::P22412
Residue:409
BDBM50024069
NameBDBM50024069
Synonyms:7-Carboxymethylsulfanyl-2-[(2,2-dimethyl-cyclopropanecarbonyl)-amino]-hept-2-enoic acid | CHEMBL11777
TypeSmall organic molecule
Emp. Form.C15H23NO5S
Mol. Mass.329.412
SMILESCC1(C)CC1C(=O)N\C(=C/CCCCSCC(O)=O)C(O)=O