Reaction Details
TargetBifunctional dihydrofolate reductase-thymidylate synthase
LigandBDBM50291772
Substrate/Competitorn/a
Meas. Tech.ChEMBL_55096 (CHEMBL875027)
Ki 6.918E1±n/a nM
Citation Booth, RGSelassie, CDHansch, CSanti, DV Quantitative structure-activity relationship of triazine-antifolate inhibition of Leishmania dihydrofolate reductase and cell growth. J Med Chem30:1218-24 (1987) Bifunctional dihydrofolate reductase-thymidylate synthase
Name:Bifunctional dihydrofolate reductase-thymidylate synthase
Type:Protein
Mol. Mass.:58691.04
Organism:Leishmania major
Description:P07382
Residue:520
BDBM50291772
NameBDBM50291772
Synonyms:6,6-Dimethyl-1-[3-(2,4,5-trichloro-phenoxymethyl)-phenyl]-1,6-dihydro-[1,3,5]triazine-2,4-diamine | CHEMBL282044
TypeSmall organic molecule
Emp. Form.C18H18Cl3N5O
Mol. Mass.426.727
SMILESCC1(C)N=C(N)N=C(N)N1c1cccc(COc2cc(Cl)c(Cl)cc2Cl)c1