Reaction Details
TargetBifunctional dihydrofolate reductase-thymidylate synthase
LigandBDBM50291776
Substrate/Competitorn/a
Meas. Tech.ChEMBL_55096 (CHEMBL875027)
Ki 3.631E5±n/a nM
Citation Booth, RGSelassie, CDHansch, CSanti, DV Quantitative structure-activity relationship of triazine-antifolate inhibition of Leishmania dihydrofolate reductase and cell growth. J Med Chem30:1218-24 (1987) Bifunctional dihydrofolate reductase-thymidylate synthase
Name:Bifunctional dihydrofolate reductase-thymidylate synthase
Type:Protein
Mol. Mass.:58691.04
Organism:Leishmania major
Description:P07382
Residue:520
BDBM50291776
NameBDBM50291776
Synonyms:3-(4,6-Diamino-2,2-dimethyl-2H-[1,3,5]triazin-1-yl)-benzenesulfonamide | CHEMBL266734
TypeSmall organic molecule
Emp. Form.C11H16N6O2S
Mol. Mass.296.349
SMILESCC1(C)N=C(N)N=C(N)N1c1cccc(c1)S(N)(=O)=O