Reaction Details
TargetBifunctional dihydrofolate reductase-thymidylate synthase
LigandBDBM50291787
Substrate/Competitorn/a
Meas. Tech.ChEMBL_55096 (CHEMBL875027)
Ki 3.388E2±n/a nM
Citation Booth, RGSelassie, CDHansch, CSanti, DV Quantitative structure-activity relationship of triazine-antifolate inhibition of Leishmania dihydrofolate reductase and cell growth. J Med Chem30:1218-24 (1987) Bifunctional dihydrofolate reductase-thymidylate synthase
Name:Bifunctional dihydrofolate reductase-thymidylate synthase
Type:Protein
Mol. Mass.:58691.04
Organism:Leishmania major
Description:P07382
Residue:520
BDBM50291787
NameBDBM50291787
Synonyms:6,6-Dimethyl-1-[3-(4-pentyl-phenoxymethyl)-phenyl]-1,6-dihydro-[1,3,5]triazine-2,4-diamine xv6,6-Dimethyl-1-[3-(4-pentyl-phenoxymethyl)-phenyl]-1,6-dihydro-[13,5]triazine-2,4-diamine
TypeSmall organic molecule
Emp. Form.C23H31N5O
Mol. Mass.393.5251
SMILESCCCCCc1ccc(OCc2cccc(c2)N2C(N)=NC(N)=NC2(C)C)cc1