Reaction Details
TargetBifunctional dihydrofolate reductase-thymidylate synthase
LigandBDBM50291789
Substrate/Competitorn/a
Meas. Tech.ChEMBL_55096 (CHEMBL875027)
Ki 2.239E2±n/a nM
Citation Booth, RGSelassie, CDHansch, CSanti, DV Quantitative structure-activity relationship of triazine-antifolate inhibition of Leishmania dihydrofolate reductase and cell growth. J Med Chem30:1218-24 (1987) Bifunctional dihydrofolate reductase-thymidylate synthase
Name:Bifunctional dihydrofolate reductase-thymidylate synthase
Type:Protein
Mol. Mass.:58691.04
Organism:Leishmania major
Description:P07382
Residue:520
BDBM50291789
NameBDBM50291789
Synonyms:1-[3-(3-Chloro-phenoxymethyl)-phenyl]-6,6-dimethyl-1,6-dihydro-[1,3,5]triazine-2,4-diamine xv1-[3-(3-Chloro-phenoxymethyl)-phenyl]-6,6-dimethyl-1,6-dihydro-[1,3,5]triazine-2,4-diamine
TypeSmall organic molecule
Emp. Form.C18H20ClN5O
Mol. Mass.357.837
SMILESCC1(C)N=C(N)N=C(N)N1c1cccc(COc2cccc(Cl)c2)c1