Reaction Details
TargetBifunctional dihydrofolate reductase-thymidylate synthase
LigandBDBM50291793
Substrate/Competitorn/a
Meas. Tech.ChEMBL_55096 (CHEMBL875027)
Ki 2.188E3±n/a nM
Citation Booth, RGSelassie, CDHansch, CSanti, DV Quantitative structure-activity relationship of triazine-antifolate inhibition of Leishmania dihydrofolate reductase and cell growth. J Med Chem30:1218-24 (1987) Bifunctional dihydrofolate reductase-thymidylate synthase
Name:Bifunctional dihydrofolate reductase-thymidylate synthase
Type:Protein
Mol. Mass.:58691.04
Organism:Leishmania major
Description:P07382
Residue:520
BDBM50291793
NameBDBM50291793
Synonyms:6,6-Dimethyl-1-(3-trifluoromethyl-phenyl)-1,6-dihydro-[1,3,5]triazine-2,4-diamine | CHEMBL6948
TypeSmall organic molecule
Emp. Form.C12H14F3N5
Mol. Mass.285.2683
SMILESCC1(C)N=C(N)N=C(N)N1c1cccc(c1)C(F)(F)F