Reaction Details
TargetBifunctional dihydrofolate reductase-thymidylate synthase
LigandBDBM50291803
Substrate/Competitorn/a
Meas. Tech.ChEMBL_55096 (CHEMBL875027)
Ki 7.244E1±n/a nM
Citation Booth, RGSelassie, CDHansch, CSanti, DV Quantitative structure-activity relationship of triazine-antifolate inhibition of Leishmania dihydrofolate reductase and cell growth. J Med Chem30:1218-24 (1987) Bifunctional dihydrofolate reductase-thymidylate synthase
Name:Bifunctional dihydrofolate reductase-thymidylate synthase
Type:Protein
Mol. Mass.:58691.04
Organism:Leishmania major
Description:P07382
Residue:520
BDBM50291803
NameBDBM50291803
Synonyms:1-(3-Dodecyl-phenyl)-6,6-dimethyl-1,6-dihydro-[1,3,5]triazine-2,4-diamine | CHEMBL21254
TypeSmall organic molecule
Emp. Form.C23H39N5
Mol. Mass.385.5893
SMILESCCCCCCCCCCCCc1cccc(c1)N1C(N)=NC(N)=NC1(C)C