Reaction Details
TargetCholecystokinin receptor type A/Gastrin/cholecystokinin type B receptor
LigandBDBM25878
Substrate/Competitorn/a
Meas. Tech.ChEMBL_49555 (CHEMBL663471)
IC50>100000±n/a nM
Citation Evans, BERittle, KEBock, MGDiPardo, RMFreidinger, RMWhitter, WLGould, NPLundell, GFHomnick, CFVeber, DF Design of nonpeptidal ligands for a peptide receptor: cholecystokinin antagonists. J Med Chem30:1229-39 (1987) Cholecystokinin receptor type A/Gastrin/cholecystokinin type B receptor
Name:Cholecystokinin receptor type A/Gastrin/cholecystokinin type B receptor
Synonyms:Cholecystokinin receptor
Type:n/a
Mol. Mass.:n/a
Description:ASSAY_ID of ChEMBL is 1544143
Components:This complex has 2 components.
Component 1
Name:Gastrin/cholecystokinin type B receptor
Type:Enzyme Catalytic Domain
Mol. Mass.:48980.43
Organism:RAT
Description:Cholecystokinin A CCKBR RAT::P30553
Residue:452
Component 2
Name:Cholecystokinin receptor type A
Synonyms:CCKAR_RAT Cholecystokinin peripheral Cholecystokinin receptor type A
Type:Enzyme Catalytic Domain
Mol. Mass.:49676.37
Organism:RAT
Description:Cholecystokinin central 0 RAT::P30551
Residue:444
BDBM25878
NameBDBM25878
Synonyms:5-(2-fluorophenyl)-1-methyl-7-nitro-2,3-dihydro-1H-1,4-benzodiazepin-2-one Flunitrazepam [3H]flunitrazepam
Typeradiolabeled ligand
Emp. Form.C16H12FN3O3
Mol. Mass.313.2832
SMILESCN1c2ccc(cc2C(=NCC1=O)c1ccccc1F)[N+]([O-])=O