Reaction Details
TargetN-acetyllactosaminide alpha-1,3-galactosyltransferase
LigandBDBM50118213
Substrate/Competitorn/a
Meas. Tech.ChEBML_219109
Ki 128000±n/a nM
Citation Vaghefi, MMBernacki, RJDalley, NKWilson, BERobins, RK Synthesis of glycopyranosylphosphonate analogues of certain natural nucleoside diphosphate sugars as potential inhibitors of glycosyltransferases. J Med Chem30:1383-91 (1987) N-acetyllactosaminide alpha-1,3-galactosyltransferase
Name:N-acetyllactosaminide alpha-1,3-galactosyltransferase
Type:PROTEIN
Mol. Mass.:46474.57
Organism:Mus musculus
Description:ChEMBL_219109
Residue:394
BDBM50118213
NameBDBM50118213
Synonyms:5'-UTP H4utp uridine 5'-(tetrahydrogen triphosphate) | uridine 5'-triphosphoric acid
TypeSmall organic molecule
Emp. Form.C9H15N2O15P3
Mol. Mass.484.1411
SMILESO[C@@H]1[C@@H](COP(O)(=O)OP(O)(=O)OP(O)(O)=O)O[C@H]([C@@H]1O)n1ccc(=O)[nH]c1=O