Reaction Details
TargetSodium-dependent dopamine transporter
LigandBDBM50010859
Substrate/Competitorn/a
Meas. Tech.ChEBML_193333
Ki>10000±n/a nM
Citation Maryanoff, BEMcComsey, DFGardocki, JFShank, RPCostanzo, MJNortey, SOSchneider, CRSetler, PE Pyrroloisoquinoline antidepressants. 2. In-depth exploration of structure-activity relationships. J Med Chem30:1433-54 (1987) Sodium-dependent dopamine transporter
Name:Sodium-dependent dopamine transporter
Type:Multi-pass membrane protein
Mol. Mass.:68749.45
Organism:Rattus norvegicus (rat)
Description:P23977
Residue:619
BDBM50010859
NameBDBM50010859
Synonyms:CHEMBL11 IMIPRAMINE PAMOATE | Imipramin
TypeSmall organic molecule
Emp. Form.C19H24N2
Mol. Mass.280.4073
SMILESCN(C)CCCN1c2ccccc2CCc2ccccc12