Reaction Details
TargetCytosol aminopeptidase
LigandBDBM50024594
Substrate/Competitorn/a
Meas. Tech.ChEBML_98405
Ki 230±n/a nM
Citation Giannousis, PPBartlett, PA Phosphorus amino acid analogues as inhibitors of leucine aminopeptidase. J Med Chem30:1603-9 (1987) Cytosol aminopeptidase
Name:Cytosol aminopeptidase
Type:PROTEIN
Mol. Mass.:56171.75
Organism:Homo sapiens (Human)
Description:ChEMBL_1507539
Residue:519
BDBM50024594
NameBDBM50024594
Synonyms:(R)-1-Ammonium-3-methyl-butane-1-phosphonic acid anion LEUCINE PHOSPHONIC ACID
TypeSmall organic molecule
Emp. Form.C5H14NO3P
Mol. Mass.167.1433
SMILESCC(C)C[C@H]([NH3+])P(O)([O-])=O