Reaction Details
TargetDihydrofolate reductase
LigandBDBM50422885
Substrate/Competitorn/a
Meas. Tech.ChEMBL_54411 (CHEMBL667169)
pH8.5±n/a
Kd 300±n/a nM
Commentsextracted
Citation Taira, KBenkovic, SJ Evaluation of the importance of hydrophobic interactions in drug binding to dihydrofolate reductase. J Med Chem31:129-37 (1988) Dihydrofolate reductase
Name:Dihydrofolate reductase
Type:n/a
Mol. Mass.:17532.46
Organism:Escherichia coli
Description:n/a
Residue:157
BDBM50422885
NameBDBM50422885
Synonyms:CHEMBL2364573 | NADPH
TypeSmall organic molecule
Emp. Form.C21H28N7O17P3
Mol. Mass.743.405
SMILESNC(=O)c1ccc[n+](c1)[C@H]1O[C@@H](COP([O-])(=O)OP(O)(=O)OC[C@H]2O[C@H]([C@H](OP(O)(O)=O)[C@@H]2O)n2cnc3c(N)ncnc23)[C@H](O)[C@@H]1O