Reaction Details
TargetDihydrofolate reductase
LigandBDBM18044
Substrate/Competitorn/a
Meas. Tech.ChEMBL_54409 (CHEMBL667167)
pH7±n/a
Temperature298.15±n/a K
Kd 6600±n/a nM
Citation Taira, KBenkovic, SJ Evaluation of the importance of hydrophobic interactions in drug binding to dihydrofolate reductase. J Med Chem31:129-37 (1988) Dihydrofolate reductase
Name:Dihydrofolate reductase
Type:n/a
Mol. Mass.:17532.46
Organism:Escherichia coli
Description:n/a
Residue:157
BDBM18044
NameBDBM18044
Synonyms:(2S)-2-[(4-{[(2-amino-4-oxo-1,4,7,8-tetrahydropteridin-6-yl)methyl]amino}phenyl)formamido]pentanedioic acid dihydrofolic acid
TypeSmall organic molecule
Emp. Form.C19H21N7O6
Mol. Mass.443.4133
SMILESNc1nc2NCC(CNc3ccc(cc3)C(=O)N[C@@H](CCC(O)=O)C(O)=O)=Nc2c(=O)[nH]1