Reaction Details
TargetDihydrofolate reductase
LigandBDBM50022833
Substrate/Competitorn/a
Meas. Tech.ChEMBL_54409 (CHEMBL667167)
pH7±n/a
Kd 300±n/a nM
Commentsextracted
Citation Taira, KBenkovic, SJ Evaluation of the importance of hydrophobic interactions in drug binding to dihydrofolate reductase. J Med Chem31:129-37 (1988) Dihydrofolate reductase
Name:Dihydrofolate reductase
Type:n/a
Mol. Mass.:17532.46
Organism:Escherichia coli
Description:n/a
Residue:157
BDBM50022833
NameBDBM50022833
Synonyms:(S)-2-{4-[(2-Amino-4-oxo-1,4,5,6,7,8-hexahydro-pteridin-6-ylmethyl)-amino]-benzoylamino}-pentanedioic acid CHEMBL91866
TypeSmall organic molecule
Emp. Form.C19H23N7O6
Mol. Mass.445.4292
SMILESNc1nc2NCC(CNc3ccc(cc3)C(=O)N[C@@H](CCC(O)=O)C(O)=O)Nc2c(=O)[nH]1