Reaction Details
TargetThymidylate synthase
LigandBDBM50022387
Substrate/Competitorn/a
Meas. Tech.ChEBML_209112
IC50 75000±n/a nM
Citation DeGraw, JIColwell, WTBrown, VHSato, MKisliuk, RLGaumont, YThorndike, JSirotnak, FM Synthesis and biological evaluation of 8-deazahomofolic acid and its tetrahydro derivative. J Med Chem31:150-3 (1988) Thymidylate synthase
Name:Thymidylate synthase
Type:Enzyme
Mol. Mass.:36576.54
Organism:Lactobacillus casei
Description:n/a
Residue:316
BDBM50022387
NameBDBM50022387
Synonyms:2-{4-[(2-Amino-4-hydroxy-5,6,7,8-tetrahydro-pyrido[3,2-d]pyrimidin-6-ylmethyl)-amino]-benzoylamino}-pentanedioic acid | CHEMBL36639
TypeSmall organic molecule
Emp. Form.C20H24N6O6
Mol. Mass.444.4412
SMILESNc1nc2CCC(CNc3ccc(cc3)C(=O)NC(CCC(O)=O)C(O)=O)Nc2c(=O)[nH]1