Reaction Details
TargetBifunctional purine biosynthesis protein ATIC
LigandBDBM50022386
Substrate/Competitorn/a
Meas. Tech.ChEBML_28410
IC50 20000±n/a nM
Citation DeGraw, JIColwell, WTBrown, VHSato, MKisliuk, RLGaumont, YThorndike, JSirotnak, FM Synthesis and biological evaluation of 8-deazahomofolic acid and its tetrahydro derivative. J Med Chem31:150-3 (1988) Bifunctional purine biosynthesis protein ATIC
Name:Bifunctional purine biosynthesis protein ATIC
Type:Protein
Mol. Mass.:64616.62
Organism:Homo sapiens (Human)
Description:P31939
Residue:592
BDBM50022386
NameBDBM50022386
Synonyms:2-{4-[2-(2-Amino-4-hydroxy-5,6,7,8-tetrahydro-pyrido[3,2-d]pyrimidin-6-yl)-ethylamino]-benzoylamino}-pentanedioic acid | CHEMBL290815
TypeSmall organic molecule
Emp. Form.C21H26N6O6
Mol. Mass.458.4677
SMILESNc1nc2CCC(CCNc3ccc(cc3)C(=O)NC(CCC(O)=O)C(O)=O)Nc2c(=O)[nH]1