Reaction Details
TargetAdenosine receptor A1
LigandBDBM50397724
Substrate/Competitorn/a
Meas. Tech.ChEMBL_29324 (CHEMBL642988)
Ki 5.1±n/a nM
Citation Trivedi, BKBristol, JABruns, RFHaleen, SJSteffen, RP N6-(arylalkyl)adenosines. Identification of N6-(9-fluorenylmethyl)adenosine as a highly potent agonist for the adenosine A2 receptor. J Med Chem31:271-3 (1988) Adenosine receptor A1
Name:Adenosine receptor A1
Type:Protein
Mol. Mass.:36704.13
Organism:Rattus norvegicus (rat)
Description:n/a
Residue:326
BDBM50397724
NameBDBM50397724
Synonyms:CHEMBL2181971
TypeSmall organic molecule
Emp. Form.C24H23N5O4
Mol. Mass.445.4705
SMILESOC[C@H]1O[C@H]([C@H](O)[C@@H]1O)n1cnc2c(NCC3c4ccccc4-c4ccccc34)ncnc12