Reaction Details
TargetD(2) dopamine receptor
LigandBDBM50022051
Substrate/Competitorn/a
Meas. Tech.ChEBML_62404
Ki 915±n/a nM
Citation Charifson, PSWyrick, SDHoffman, AJSimmons, RMBowen, JPMcDougald, DLMailman, RB Synthesis and pharmacological characterization of 1-phenyl-, 4-phenyl-, and 1-benzyl-1,2,3,4-tetrahydroisoquinolines as dopamine receptor ligands. J Med Chem31:1941-6 (1988) D(2) dopamine receptor
Name:D(2) dopamine receptor
Type:G Protein-Coupled Receptor (GPCR)
Mol. Mass.:50931.60
Organism:Rattus norvegicus (rat)
Description:P61169
Residue:444
BDBM50022051
NameBDBM50022051
Synonyms:1-Phenyl-6-chloro-7-hydroxy-N-methyl-1,2,3,4-tetrahydroisoquinoline CHEMBL57579
TypeSmall organic molecule
Emp. Form.C16H16ClNO
Mol. Mass.273.757
SMILESCN1CCc2cc(Cl)c(O)cc2C1c1ccccc1