Reaction Details
TargetD(1A) dopamine receptor
LigandBDBM50038349
Substrate/Competitorn/a
Meas. Tech.ChEBML_58650
Ki 6.6±n/a nM
Citation Charifson, PSWyrick, SDHoffman, AJSimmons, RMBowen, JPMcDougald, DLMailman, RB Synthesis and pharmacological characterization of 1-phenyl-, 4-phenyl-, and 1-benzyl-1,2,3,4-tetrahydroisoquinolines as dopamine receptor ligands. J Med Chem31:1941-6 (1988) D(1A) dopamine receptor
Name:D(1A) dopamine receptor
Type:Enzyme Catalytic Domain
Mol. Mass.:49429.75
Organism:RAT
Description:P18901
Residue:446
BDBM50038349
NameBDBM50038349
Synonyms:(S)-6-Chloro-2-methyl-1-phenyl-1,2,3,4-tetrahydro-isoquinolin-7-ol CHEMBL303993
TypeSmall organic molecule
Emp. Form.C16H16ClNO
Mol. Mass.273.757
SMILESCN1CCc2cc(Cl)c(O)cc2[C@@H]1c1ccccc1