Reaction Details
TargetBeta-1 adrenergic receptor
LigandBDBM50029051
Substrate/Competitorn/a
Meas. Tech.ChEBML_39181
Ki 400±n/a nM
Citation Adejare, AGusovsky, FPadgett, WCreveling, CRDaly, JWKirk, KL Syntheses and adrenergic activities of ring-fluorinated epinephrines. J Med Chem31:1972-7 (1988) Beta-1 adrenergic receptor
Name:Beta-1 adrenergic receptor
Type:Enzyme Catalytic Domain
Mol. Mass.:50540.48
Organism:GUINEA PIG
Description:adrenergic Beta1 ADRB1 GUINEA PIG::B0FL73
Residue:467
BDBM50029051
NameBDBM50029051
Synonyms:(-)-arterenol (-)-norepinephrine (R)-4-(2-amino-1-hydroxyethyl)-1,2-benzenediol (R)-norepinephrine CHEMBL1437 | NOREPINEPHRINE
TypeSmall organic molecule
Emp. Form.C8H11NO3
Mol. Mass.169.1778
SMILESNC[C@H](O)c1ccc(O)c(O)c1