Reaction Details
TargetBeta-1 adrenergic receptor
LigandBDBM50019057
Substrate/Competitorn/a
Meas. Tech.ChEMBL_39181 (CHEMBL654478)
EC50>1500±n/a nM
Citation Adejare, AGusovsky, FPadgett, WCreveling, CRDaly, JWKirk, KL Syntheses and adrenergic activities of ring-fluorinated epinephrines. J Med Chem31:1972-7 (1988) Beta-1 adrenergic receptor
Name:Beta-1 adrenergic receptor
Type:Enzyme Catalytic Domain
Mol. Mass.:50540.48
Organism:GUINEA PIG
Description:adrenergic Beta1 ADRB1 GUINEA PIG::B0FL73
Residue:467
BDBM50019057
NameBDBM50019057
Synonyms:(+/-)4-Fluoro-5-(1-hydroxy-2-methylamino-ethyl)-benzene-1,2-diol 4-Fluoro-5-(1-hydroxy-2-methylamino-ethyl)-benzene-1,2-diol(6-FEPI) | CHEMBL42359
TypeSmall organic molecule
Emp. Form.C9H12FNO3
Mol. Mass.201.1949
SMILESCNCC(O)c1cc(O)c(O)cc1F