Reaction Details
TargetAlpha-1A adrenergic receptor
LigandBDBM50019060
Substrate/Competitorn/a
Meas. Tech.ChEBML_33232
EC50 71000±n/a nM
Citation Adejare, AGusovsky, FPadgett, WCreveling, CRDaly, JWKirk, KL Syntheses and adrenergic activities of ring-fluorinated epinephrines. J Med Chem31:1972-7 (1988) Alpha-1A adrenergic receptor
Name:Alpha-1A adrenergic receptor
Type:Cell-surface receptors
Mol. Mass.:51511.67
Organism:Homo sapiens (Human)
Description:P35348
Residue:466
BDBM50019060
NameBDBM50019060
Synonyms:(+/-)4-(2-Amino-1-hydroxy-ethyl)-3-fluoro-benzene-1,2-diol 4-(2-Amino-1-hydroxy-ethyl)-3-fluoro-benzene-1,2-diol(2-FNE) | CHEMBL287587
TypeSmall organic molecule
Emp. Form.C8H10FNO3
Mol. Mass.187.1683
SMILESNCC(O)c1ccc(O)c(O)c1F