Reaction Details
TargetAlpha-1A adrenergic receptor
LigandBDBM50019057
Substrate/Competitorn/a
Meas. Tech.ChEMBL_33232 (CHEMBL873047)
Ki 700±n/a nM
Citation Adejare, AGusovsky, FPadgett, WCreveling, CRDaly, JWKirk, KL Syntheses and adrenergic activities of ring-fluorinated epinephrines. J Med Chem31:1972-7 (1988) Alpha-1A adrenergic receptor
Name:Alpha-1A adrenergic receptor
Type:Cell-surface receptors
Mol. Mass.:51511.67
Organism:Homo sapiens (Human)
Description:P35348
Residue:466
BDBM50019057
NameBDBM50019057
Synonyms:(+/-)4-Fluoro-5-(1-hydroxy-2-methylamino-ethyl)-benzene-1,2-diol 4-Fluoro-5-(1-hydroxy-2-methylamino-ethyl)-benzene-1,2-diol(6-FEPI) | CHEMBL42359
TypeSmall organic molecule
Emp. Form.C9H12FNO3
Mol. Mass.201.1949
SMILESCNCC(O)c1cc(O)c(O)cc1F