Reaction Details
TargetKappa-type opioid receptor
LigandBDBM50019094
Substrate/Competitorn/a
Meas. Tech.ChEBML_146073
Kd 450±n/a nM
Citation Lawson, JACheng, ADeGraw, JFrenking, GUyeno, EToll, LLoew, GH Effects of addition of a 2-methyl group to ethyl nipecotates (beta-meperidines) on receptor affinities and opiate agonist/antagonist activities. J Med Chem31:2015-21 (1988) Kappa-type opioid receptor
Name:Kappa-type opioid receptor
Type:G Protein-Coupled Receptor (GPCR)
Mol. Mass.:42744.99
Organism:Cavia porcellus (domestic guinea pig)
Description:P41144
Residue:380
BDBM50019094
NameBDBM50019094
Synonyms:1-Allyl-3-(3-hydroxy-phenyl)-piperidine-3-carboxylic acid ethyl ester | CHEMBL60294
TypeSmall organic molecule
Emp. Form.C17H23NO3
Mol. Mass.289.3694
SMILESCCOC(=O)[C@@]1(CCCN(CC=C)C1)c1cccc(O)c1