Reaction Details
TargetAminopeptidase B
LigandBDBM50022743
Substrate/Competitorn/a
Meas. Tech.ChEBML_35352
Ki 0.910000±n/a nM
Citation Ocain, TDRich, DH Synthesis of sulfur-containing analogues of bestatin. Inhibition of aminopeptidases by alpha-thiolbestatin analogues. J Med Chem31:2193-9 (1988) Aminopeptidase B
Name:Aminopeptidase B
Type:PROTEIN
Mol. Mass.:72609.93
Organism:Rattus norvegicus
Description:ChEMBL_1344423
Residue:650
BDBM50022743
NameBDBM50022743
Synonyms:2,6-Diamino-hexane-1-thiol | CHEMBL68509
TypeSmall organic molecule
Emp. Form.C6H16N2S
Mol. Mass.148.27
SMILESNCCCC[C@@H](N)CS