Reaction Details
TargetAminopeptidase B
LigandBDBM50022751
Substrate/Competitorn/a
Meas. Tech.ChEBML_35352
Ki 4.6±n/a nM
Citation Ocain, TDRich, DH Synthesis of sulfur-containing analogues of bestatin. Inhibition of aminopeptidases by alpha-thiolbestatin analogues. J Med Chem31:2193-9 (1988) Aminopeptidase B
Name:Aminopeptidase B
Type:PROTEIN
Mol. Mass.:72609.93
Organism:Rattus norvegicus
Description:ChEMBL_1344423
Residue:650
BDBM50022751
NameBDBM50022751
Synonyms:2-(3-Amino-2-mercapto-4-phenyl-butyrylamino)-4-methyl-pentanoic acid: CHEMBL305198
TypeSmall organic molecule
Emp. Form.C16H24N2O3S
Mol. Mass.324.438
SMILESCC(C)C[C@H](NC(=O)[C@@H](S)[C@H](N)Cc1ccccc1)C(O)=O