Reaction Details
TargetAcetylcholinesterase
LigandBDBM50022772
Substrate/Competitorn/a
Meas. Tech.ChEBML_27978
IC50 480±n/a nM
Citation Yu, QSAtack, JRRapoport, SIBrossi, A Synthesis and anticholinesterase activity of (-)-N1-norphysostigmine, (-)-eseramine, and other N(1)-substituted analogues of (-)-physostigmine. J Med Chem31:2297-300 (1989) Acetylcholinesterase
Name:Acetylcholinesterase
Type:Enzyme
Mol. Mass.:71812.79
Organism:Electrophorus electricus (Electric eel)
Description:n/a
Residue:633
BDBM50022772
NameBDBM50022772
Synonyms:CHEMBL1025 Diisopropyl fluorophosphonate Diisopropyl phosphorofluoridate Diisopropylfluorophosphoric acid ester Fluorodiisopropyl phosphate Isofluorphate Isopropyl fluophosphate Neoglaucit bis(propan-2-yl) fluorophosphate | diisopropyl fluorophosphate
TypeSmall organic molecule
Emp. Form.C6H14FO3P
Mol. Mass.184.1457
SMILESCC(C)OP(F)(=O)OC(C)C