Reaction Details
TargetMu-type opioid receptor
LigandBDBM21025
Substrate/Competitorn/a
Meas. Tech.ChEMBL_149307 (CHEMBL757304)
Ki 8.4±n/a nM
Citation Gacel, GZajac, JMDelay-Goyet, PDaugé, VRoques, BP Investigation of the structural parameters involved in the mu and delta opioid receptor discrimination of linear enkephalin-related peptides. J Med Chem31:374-83 (1988) Mu-type opioid receptor
Name:Mu-type opioid receptor
Type:G Protein-Coupled Receptor (GPCR)
Mol. Mass.:44503.11
Organism:Rattus norvegicus (rat)
Description:Competition binding assays were carried out using membrane preparations from transfected HN9.10 cells that constitutively expressed the mu opioid receptor.
Residue:398
BDBM21025
NameBDBM21025
Synonyms:(2R)-2-[(2S)-2-{2-[(2R)-2-[(2S)-2-amino-3-(4-hydroxyphenyl)propanamido]propanamido]acetamido}-3-phenylpropanamido]-4-methylpentanoic acid BW-180C DADLE H-Tyr-D-Ala-Gly-Phe-D-Leu-OH | [D-Ala2-D-Leu5]enkephalin
TypeANALGESIC
Emp. Form.C29H39N5O7
Mol. Mass.569.6493
SMILESCC(C)C[C@@H](NC(=O)[C@H](Cc1ccccc1)NC(=O)CNC(=O)[C@@H](C)NC(=O)[C@@H](N)Cc1ccc(O)cc1)C(O)=O