Reaction Details
TargetDihydrofolate reductase
LigandBDBM50367055
Substrate/Competitorn/a
Meas. Tech.ChEBML_54449
IC50 2±n/a nM
Citation Rosowsky, ABader, HForsch, RAMoran, RGFreisheim, JH Methotrexate analogues. 31. Meta and ortho isomers of aminopterin, compounds with a double bond in the side chain, and a novel analogue modified at the alpha-carbon: chemical and in vitro biological studies. J Med Chem31:763-8 (1988) Dihydrofolate reductase
Name:Dihydrofolate reductase
Type:Enzyme
Mol. Mass.:21608.82
Organism:Mus musculus (Mouse)
Description:n/a
Residue:187
BDBM50367055
NameBDBM50367055
Synonyms:4-Aminofolic acid AMINOPTERIN | Aminopteroylglutamic acid
TypeSmall organic molecule
Emp. Form.C19H20N8O5
Mol. Mass.440.4127
SMILESNc1nc(N)c2nc(CNc3ccc(cc3)C(=O)N[C@@H](CCC(O)=O)C(O)=O)cnc2n1