Reaction Details
TargetAdenosine kinase
LigandBDBM50100587
Substrate/Competitorn/a
Meas. Tech.ChEMBL_31121 (CHEMBL643549)
Ki 3000±n/a nM
Citation Moss, RJPetrie, CRMeyer, RBNord, LDWillis, RCSmith, RALarson, SBKini, GDRobins, RK Synthesis, intramolecular hydrogen bonding, and biochemical studies of clitocine, a naturally occurring exocyclic amino nucleoside. J Med Chem31:786-90 (1988) Adenosine kinase
Name:Adenosine kinase
Type:PROTEIN
Mol. Mass.:40545.97
Organism:Homo sapiens (Human)
Description:ChEMBL_1467841
Residue:362
BDBM50100587
NameBDBM50100587
Synonyms:(2R,3R,4S,5R)-2-(6-Amino-5-nitro-pyrimidin-4-ylamino)-5-hydroxymethyl-tetrahydro-furan-3,4-diol CHEMBL304179
TypeSmall organic molecule
Emp. Form.C9H13N5O6
Mol. Mass.287.2294
SMILESNc1ncnc(N[C@@H]2O[C@H](CO)[C@@H](O)[C@H]2O)c1[N+]([O-])=O