Reaction Details
TargetKappa-type opioid receptor
LigandBDBM50008854
Substrate/Competitorn/a
Meas. Tech.ChEMBL_146378 (CHEMBL754735)
Ki 1500±n/a nM
Citation Clark, CRHalfpenny, PRHill, RGHorwell, DCHughes, JJarvis, TCRees, DCSchofield, D Highly selective kappa opioid analgesics. Synthesis and structure-activity relationships of novel N-[(2-aminocyclohexyl)aryl]acetamide and N-[(2-aminocyclohexyl)aryloxy]acetamide derivatives. J Med Chem31:831-6 (1988) Kappa-type opioid receptor
Name:Kappa-type opioid receptor
Type:G Protein-Coupled Receptor (GPCR)
Mol. Mass.:42744.99
Organism:Cavia porcellus (domestic guinea pig)
Description:P41144
Residue:380
BDBM50008854
NameBDBM50008854
Synonyms:2-Benzo[b]thiophen-4-yl-N-methyl-N-(2-pyrrolidin-1-yl-cyclohexyl)-acetamide; hydrochloride | CHEMBL543331
TypeSmall organic molecule
Emp. Form.C21H28N2OS
Mol. Mass.356.525
SMILESCN([C@H]1CCCC[C@@H]1N1CCCC1)C(=O)Cc1cccc2sccc12