Reaction Details
TargetD(2) dopamine receptor
LigandBDBM21395
Substrate/Competitorn/a
Meas. Tech.ChEBML_63034
Ki 359±n/a nM
Citation Kung, HFKasliwal, RPan, SGKung, MPMach, RHGuo, YZ Dopamine D-2 receptor imaging radiopharmaceuticals: synthesis, radiolabeling, and in vitro binding of (R)-(+)- and (S)-(-)-3-iodo-2-hydroxy-6-methoxy-N- [(1-ethyl-2-pyrrolidinyl)methyl]benzamide. J Med Chem31:1039-43 (1988) D(2) dopamine receptor
Name:D(2) dopamine receptor
Type:G Protein-Coupled Receptor (GPCR)
Mol. Mass.:50931.60
Organism:Rattus norvegicus (rat)
Description:P61169
Residue:444
BDBM21395
NameBDBM21395
Synonyms:3-(2-(4-(4-Fluorobenzoyl)piperidinol)ethyl)-2,4(1H,3H)-quinazolinedione CHEMBL1628637 Ketanserin R-41-468 [3H]-Ketanserin
Typeradiolabeled ligand
Emp. Form.C22H22FN3O3
Mol. Mass.395.4268
SMILESFc1ccc(cc1)C(=O)C1CCN(CCn2c(=O)[nH]c3ccccc3c2=O)CC1