Reaction Details
TargetThymidylate synthase
LigandBDBM50023635
Substrate/Competitorn/a
Meas. Tech.ChEBML_209138
Ki 3990±n/a nM
Citation Chang, GSchwepler, DDecedue, CJBalzarini, JDe Clercq, EMertes, MP Linear free energy relationship studies of enzyme active site binding: thymidylate synthase. J Med Chem31:1141-7 (1988) Thymidylate synthase
Name:Thymidylate synthase
Type:Enzyme
Mol. Mass.:36576.54
Organism:Lactobacillus casei
Description:n/a
Residue:316
BDBM50023635
NameBDBM50023635
Synonyms:4-[1-(4-Hydroxy-5-phosphonooxymethyl-tetrahydro-furan-2-yl)-2,4-dioxo-1,2,3,4-tetrahydro-pyrimidin-5-yl]-benzoic acid methyl ester | CHEMBL3144197
TypeSmall organic molecule
Emp. Form.C17H19N2O10P
Mol. Mass.442.3139
SMILESCOC(=O)c1ccc(cc1)-c1cn([C@H]2C[C@H](O)[C@@H](COP(O)(O)=O)O2)c(=O)[nH]c1=O