Reaction Details
TargetAngiotensin-converting enzyme
LigandBDBM50018848
Substrate/Competitorn/a
Meas. Tech.ChEBML_34931
Ki 15±n/a nM
Citation Krapcho, JTurk, CCushman, DWPowell, JRDeForrest, JMSpitzmiller, ERKaranewsky, DSDuggan, MRovnyak, GSchwartz, J Angiotensin-converting enzyme inhibitors. Mercaptan, carboxyalkyl dipeptide, and phosphinic acid inhibitors incorporating 4-substituted prolines. J Med Chem31:1148-60 (1988) Angiotensin-converting enzyme
Name:Angiotensin-converting enzyme
Type:n/a
Mol. Mass.:150405.15
Organism:Oryctolagus cuniculus
Description:n/a
Residue:1310
BDBM50018848
NameBDBM50018848
Synonyms:1-{2-[Hydroxy-(4-phenyl-butyl)-phosphinoyl]-acetyl}-pyrrolidine-2-carboxylic acid | CHEMBL277999
TypeSmall organic molecule
Emp. Form.C17H24NO5P
Mol. Mass.353.3499
SMILESOC(=O)[C@@H]1CCCN1C(=O)CP(O)(=O)CCCCc1ccccc1