Reaction Details
TargetAdenosine receptor A1
LigandBDBM50407524
Substrate/Competitorn/a
Meas. Tech.ChEBML_29311
Ki 1.6±n/a nM
Citation Cristalli, GFranchetti, PGrifantini, MVittori, SKlotz, KNLohse, MJ Adenosine receptor agonists: synthesis and biological evaluation of 1-deaza analogues of adenosine derivatives. J Med Chem31:1179-83 (1988) Adenosine receptor A1
Name:Adenosine receptor A1
Type:Protein
Mol. Mass.:36704.13
Organism:Rattus norvegicus (rat)
Description:n/a
Residue:326
BDBM50407524
NameBDBM50407524
Synonyms:CHEMBL2113390
TypeSmall organic molecule
Emp. Form.C16H21ClN4O4
Mol. Mass.368.815
SMILESOC[C@H]1O[C@H]([C@H](O)[C@@H]1O)n1cnc2c(NC3CCCC3)cc(Cl)nc12