Reaction Details
TargetAdenosine receptor A2a/A2b
LigandBDBM50163015
Substrate/Competitorn/a
Meas. Tech.ChEMBL_30569 (CHEMBL649881)
Ki 25±n/a nM
Citation Bridges, AJBruns, RFOrtwine, DFPriebe, SRSzotek, DLTrivedi, BK N6-[2-(3,5-dimethoxyphenyl)-2-(2-methylphenyl)ethyl]adenosine and its uronamide derivatives. Novel adenosine agonists with both high affinity and high selectivity for the adenosine A2 receptor. J Med Chem31:1282-5 (1988) Adenosine receptor A2a/A2b
Name:Adenosine receptor A2a/A2b
Synonyms:Adenosine A2 receptor
Type:n/a
Mol. Mass.:n/a
Description:ASSAY_ID of ChEMBL is 30560
Components:This complex has 2 components.
Component 1
Name:Adenosine receptor A2b
Type:PROTEIN
Mol. Mass.:36378.84
Organism:Rattus norvegicus
Description:ChEMBL_32934
Residue:332
Component 2
Name:Adenosine receptor A2a
Synonyms:AA2AR_RAT Adenosine A2 receptor Adenosine Receptors A2a (A2a) Adenosine receptors A2a Rat striatal adenosine A2a receptor
Type:G Protein-Coupled Receptor (GPCR)
Mol. Mass.:45015.65
Organism:Rattus norvegicus (rat)
Description:Rat A2A receptors expressed in CHO cells.
Residue:410
BDBM50163015
NameBDBM50163015
Synonyms:(2R,3R,4S,5R)-2-[6-(2,2-Diphenyl-ethylamino)-purin-9-yl]-5-hydroxymethyl-tetrahydro-furan-3,4-diol | CHEMBL193692
TypeSmall organic molecule
Emp. Form.C24H25N5O4
Mol. Mass.447.4864
SMILESOC[C@H]1O[C@H]([C@H](O)[C@@H]1O)n1cnc2c(NCC(c3ccccc3)c3ccccc3)ncnc12