Reaction Details
TargetAdenosine receptor A1
LigandBDBM50367688
Substrate/Competitorn/a
Meas. Tech.ChEBML_28995
Ki 232±n/a nM
Citation Bridges, AJBruns, RFOrtwine, DFPriebe, SRSzotek, DLTrivedi, BK N6-[2-(3,5-dimethoxyphenyl)-2-(2-methylphenyl)ethyl]adenosine and its uronamide derivatives. Novel adenosine agonists with both high affinity and high selectivity for the adenosine A2 receptor. J Med Chem31:1282-5 (1988) Adenosine receptor A1
Name:Adenosine receptor A1
Type:Protein
Mol. Mass.:36704.13
Organism:Rattus norvegicus (rat)
Description:n/a
Residue:326
BDBM50367688
NameBDBM50367688
Synonyms:CHEMBL603791
TypeSmall organic molecule
Emp. Form.C30H34N6O6
Mol. Mass.574.6276
SMILESCOc1cc(OC)cc(c1)C(CNc1ncnc2n(cnc12)C1O[C@@H]([C@@H](O)[C@H]1O)C(=O)NC1CC1)c1ccccc1C