Reaction Details
TargetAdenosine receptor A1
LigandBDBM50367695
Substrate/Competitorn/a
Meas. Tech.ChEBML_28995
Ki 140±n/a nM
Citation Bridges, AJBruns, RFOrtwine, DFPriebe, SRSzotek, DLTrivedi, BK N6-[2-(3,5-dimethoxyphenyl)-2-(2-methylphenyl)ethyl]adenosine and its uronamide derivatives. Novel adenosine agonists with both high affinity and high selectivity for the adenosine A2 receptor. J Med Chem31:1282-5 (1988) Adenosine receptor A1
Name:Adenosine receptor A1
Type:Protein
Mol. Mass.:36704.13
Organism:Rattus norvegicus (rat)
Description:n/a
Residue:326
BDBM50367695
NameBDBM50367695
Synonyms:CHEMBL606506
TypeSmall organic molecule
Emp. Form.C28H33N5O6
Mol. Mass.535.5915
SMILESCOc1cc(OC)cc(c1)C(CNc1ncnc2n(cnc12)C1O[C@H](CO)[C@@H](O)[C@H]1O)c1c(C)cccc1C