Reaction Details
TargetDihydrofolate reductase
LigandBDBM50023713
Substrate/Competitorn/a
Meas. Tech.ChEBML_54443
IC50 27±n/a nM
Citation Rosowsky, ABader, HCucchi, CAMoran, RGKohler, WFreisheim, JH Methotrexate analogues. 33. N delta-acyl-N alpha-(4-amino-4-deoxypteroyl)-L-ornithine derivatives: synthesis and in vitro antitumor activity. J Med Chem31:1332-7 (1988) Dihydrofolate reductase
Name:Dihydrofolate reductase
Type:Enzyme
Mol. Mass.:21608.82
Organism:Mus musculus (Mouse)
Description:n/a
Residue:187
BDBM50023713
NameBDBM50023713
Synonyms:5-Benzoylamino-2-{4-[(2,4-diamino-pteridin-6-ylmethyl)-amino]-benzoylamino}-pentanoic acid | CHEMBL27109
TypeSmall organic molecule
Emp. Form.C26H27N9O4
Mol. Mass.529.5505
SMILESNc1nc(N)c2nc(CNc3ccc(cc3)C(=O)NC(CCCNC(=O)c3ccccc3)C(O)=O)cnc2n1