Reaction Details
TargetDihydrofolate reductase
LigandBDBM50020104
Substrate/Competitorn/a
Meas. Tech.ChEBML_54452
IC50 67±n/a nM
Citation Rosowsky, ABader, HKohler, WFreisheim, JHMoran, RG Methotrexate analogues. 34. Replacement of the glutamate moiety in methotrexate and aminopterin by long-chain 2-aminoalkanedioic acids. J Med Chem31:1338-44 (1988) Dihydrofolate reductase
Name:Dihydrofolate reductase
Type:Enzyme
Mol. Mass.:21608.82
Organism:Mus musculus (Mouse)
Description:n/a
Residue:187
BDBM50020104
NameBDBM50020104
Synonyms:2-{4-[(2,4-Diamino-pteridin-6-ylmethyl)-amino]-benzoylamino}-tridecanedioic acid | CHEMBL275229
TypeSmall organic molecule
Emp. Form.C27H36N8O5
Mol. Mass.552.6253
SMILESNc1nc(N)c2nc(CNc3ccc(cc3)C(=O)NC(CCCCCCCCCCC(O)=O)C(O)=O)cnc2n1