Reaction Details
TargetFolylpolyglutamate synthase, mitochondrial
LigandBDBM50020102
Substrate/Competitorn/a
Meas. Tech.ChEBML_68680
Ki 20000±n/a nM
Citation Rosowsky, ABader, HKohler, WFreisheim, JHMoran, RG Methotrexate analogues. 34. Replacement of the glutamate moiety in methotrexate and aminopterin by long-chain 2-aminoalkanedioic acids. J Med Chem31:1338-44 (1988) Folylpolyglutamate synthase, mitochondrial
Name:Folylpolyglutamate synthase, mitochondrial
Type:PROTEIN
Mol. Mass.:64969.76
Organism:Mus musculus
Description:ChEMBL_68680
Residue:587
BDBM50020102
NameBDBM50020102
Synonyms:5-Amino-2-{4-[(2,4-diamino-pteridin-6-ylmethyl)-methyl-amino]-benzoylamino}-pentanoic acid | CHEMBL28049
TypeSmall organic molecule
Emp. Form.C20H25N9O3
Mol. Mass.439.471
SMILESCN(Cc1cnc2nc(N)nc(N)c2n1)c1ccc(cc1)C(=O)N[C@@H](CCCN)C(O)=O