Reaction Details
TargetFolylpolyglutamate synthase, mitochondrial
LigandBDBM50020101
Substrate/Competitorn/a
Meas. Tech.ChEMBL_68522 (CHEMBL676946)
Ki 1900±n/a nM
Citation Rosowsky, ABader, HKohler, WFreisheim, JHMoran, RG Methotrexate analogues. 34. Replacement of the glutamate moiety in methotrexate and aminopterin by long-chain 2-aminoalkanedioic acids. J Med Chem31:1338-44 (1988) Folylpolyglutamate synthase, mitochondrial
Name:Folylpolyglutamate synthase, mitochondrial
Type:PROTEIN
Mol. Mass.:64621.95
Organism:Homo sapiens (Human)
Description:ChEMBL_68676
Residue:587
BDBM50020101
NameBDBM50020101
Synonyms:2-{4-[(2,4-Diamino-pteridin-6-ylmethyl)-amino]-benzoylamino}-4-phosphonooxy-butyric acid | CHEMBL281024
TypeSmall organic molecule
Emp. Form.C18H21N8O7P
Mol. Mass.492.3825
SMILESNc1nc(N)c2nc(CNc3ccc(cc3)C(=O)NC(CCOP(O)(O)=O)C(O)=O)cnc2n1