Reaction Details
TargetFolylpolyglutamate synthase, mitochondrial
LigandBDBM50020108
Substrate/Competitorn/a
Meas. Tech.ChEBML_68382
Ki 6000±n/a nM
Citation Rosowsky, ABader, HKohler, WFreisheim, JHMoran, RG Methotrexate analogues. 34. Replacement of the glutamate moiety in methotrexate and aminopterin by long-chain 2-aminoalkanedioic acids. J Med Chem31:1338-44 (1988) Folylpolyglutamate synthase, mitochondrial
Name:Folylpolyglutamate synthase, mitochondrial
Type:PROTEIN
Mol. Mass.:64621.95
Organism:Homo sapiens (Human)
Description:ChEMBL_68676
Residue:587
BDBM50020108
NameBDBM50020108
Synonyms:5-Amino-2-{4-[(2-amino-4-hydroxy-pteridin-6-ylmethyl)-amino]-benzoylamino}-pentanoic acid | CHEMBL431290
TypeSmall organic molecule
Emp. Form.C19H22N8O4
Mol. Mass.426.4292
SMILESNCCC[C@H](NC(=O)c1ccc(NCc2cnc3nc(N)[nH]c(=O)c3n2)cc1)C(O)=O