Reaction Details
Target5-hydroxytryptamine receptor 1A
LigandBDBM50367722
Substrate/Competitorn/a
Meas. Tech.ChEBML_1423
Ki 41±n/a nM
Citation Abou-Gharbia, MPatel, URWebb, MBMoyer, JAAndree, THMuth, EA Polycyclic aryl- and heteroarylpiperazinyl imides as 5-HT1A receptor ligands and potential anxiolytic agents: synthesis and structure-activity relationship studies. J Med Chem31:1382-92 (1988) 5-hydroxytryptamine receptor 1A
Name:5-hydroxytryptamine receptor 1A
Type:G Protein-Coupled Receptor (GPCR)
Mol. Mass.:46445.29
Organism:Rattus norvegicus (rat)
Description:Binding assays were performed using rat hippocampal membranes.
Residue:422
BDBM50367722
NameBDBM50367722
Synonyms:CHEMBL1202511
TypeSmall organic molecule
Emp. Form.C24H31N5O2
Mol. Mass.421.5352
SMILESO=C1C2C(C3C=CC2C2CCC32)C(=O)N1CCCCN1CCN(CC1)c1cnccn1