Reaction Details
Target5-hydroxytryptamine receptor 1A
LigandBDBM50367720
Substrate/Competitorn/a
Meas. Tech.ChEBML_1423
Ki 38±n/a nM
Citation Abou-Gharbia, MPatel, URWebb, MBMoyer, JAAndree, THMuth, EA Polycyclic aryl- and heteroarylpiperazinyl imides as 5-HT1A receptor ligands and potential anxiolytic agents: synthesis and structure-activity relationship studies. J Med Chem31:1382-92 (1988) 5-hydroxytryptamine receptor 1A
Name:5-hydroxytryptamine receptor 1A
Type:G Protein-Coupled Receptor (GPCR)
Mol. Mass.:46445.29
Organism:Rattus norvegicus (rat)
Description:Binding assays were performed using rat hippocampal membranes.
Residue:422
BDBM50367720
NameBDBM50367720
Synonyms:CHEMBL1202504
TypeSmall organic molecule
Emp. Form.C23H29N5O2
Mol. Mass.407.5087
SMILESO=C1C2C(C3C=CC2C2CC32)C(=O)N1CCCCN1CCN(CC1)c1ncccn1