Reaction Details
Target5-hydroxytryptamine receptor 1A
LigandBDBM50005127
Substrate/Competitorn/a
Meas. Tech.ChEBML_1423
Ki 10±n/a nM
Citation Abou-Gharbia, MPatel, URWebb, MBMoyer, JAAndree, THMuth, EA Polycyclic aryl- and heteroarylpiperazinyl imides as 5-HT1A receptor ligands and potential anxiolytic agents: synthesis and structure-activity relationship studies. J Med Chem31:1382-92 (1988) 5-hydroxytryptamine receptor 1A
Name:5-hydroxytryptamine receptor 1A
Type:G Protein-Coupled Receptor (GPCR)
Mol. Mass.:46445.29
Organism:Rattus norvegicus (rat)
Description:Binding assays were performed using rat hippocampal membranes.
Residue:422
BDBM50005127
NameBDBM50005127
Synonyms:1,1-Dioxo-2-[4-(4-pyrimidin-2-yl-piperazin-1-yl)-butyl]-1,2-dihydro-1lambda*6*-benzo[d]isothiazol-3-one 1,1-Dioxo-2-[4-(4-pyrimidin-2-yl-piperazin-1-yl)-butyl]-1,2-dihydro-1lambda*6*-benzo[d]isothiazol-3-one(Ipsapirone) IPSAPIRONE
TypeSmall organic molecule
Emp. Form.C19H23N5O3S
Mol. Mass.401.483
SMILESO=C1N(CCCCN2CCN(CC2)c2ncccn2)S(=O)(=O)c2ccccc12