Reaction Details
TargetMuscarinic acetylcholine receptor M2
LigandBDBM50367741
Substrate/Competitorn/a
Meas. Tech.ChEBML_31582
Ki 1660±n/a nM
Citation Rzeszotarski, WJMcPherson, DWFerkany, JWKinnier, WJNoronha-Blob, LKirkien-Rzeszotarski, A Affinity and selectivity of the optical isomers of 3-quinuclidinyl benzilate and related muscarinic antagonists. J Med Chem31:1463-6 (1988) Muscarinic acetylcholine receptor M2
Name:Muscarinic acetylcholine receptor M2
Type:Enzyme Catalytic Domain
Mol. Mass.:51555.53
Organism:RAT
Description:P10980
Residue:466
BDBM50367741
NameBDBM50367741
Synonyms:CHEMBL1788286
TypeSmall organic molecule
Emp. Form.C21H21NO3
Mol. Mass.335.3963
SMILESO=C(O[C@@H]1CN2CCC1CC2)C1c2ccccc2Oc2ccccc12