Reaction Details
TargetMuscarinic acetylcholine receptor M1
LigandBDBM50403547
Substrate/Competitorn/a
Meas. Tech.ChEMBL_184442 (CHEMBL790102)
Ki 0.500000±n/a nM
Citation Rzeszotarski, WJMcPherson, DWFerkany, JWKinnier, WJNoronha-Blob, LKirkien-Rzeszotarski, A Affinity and selectivity of the optical isomers of 3-quinuclidinyl benzilate and related muscarinic antagonists. J Med Chem31:1463-6 (1988) Muscarinic acetylcholine receptor M1
Name:Muscarinic acetylcholine receptor M1
Type:Enzyme Catalytic Domain
Mol. Mass.:51390.46
Organism:RAT
Description:P08482
Residue:460
BDBM50403547
NameBDBM50403547
Synonyms:ATROPEN | ATROPINE
TypeSmall organic molecule
Emp. Form.C17H23NO3
Mol. Mass.289.3694
SMILESCN1[C@H]2CC[C@@H]1C[C@@H](C2)OC(=O)C(CO)c1ccccc1